{"text_format":"1","workbook":"xlsx","n_sheets":4,"sheets":["Verktøy","Beregninger","Energimerke D","Input"],"not_rendered":{"charts":0,"images":0,"macros":1,"external_links":0,"defined_names":1,"comments":4,"pivot_tables":0},"unopened":[],"bounds":{"document_bytes":16777216,"sheet_cells":100000,"rows_first":2000,"rows_last":500,"rows_between":2000,"halvings":0,"cell_chars":16384,"cell_head_chars":4096},"cells_cut":0,"cells_raw":0,"read":"whole","date_system":"1900"}

{"sheet":"Verktøy","index":0,"n_rows":51,"n_cols":9,"rows_kept":51,"cut":false,"hidden":false,"merged":[[1,4,2,15],[44,4,46,6],[6,4,6,6],[21,4,23,6],[21,1,26,2],[8,4,8,5],[16,4,16,5]]}
[]
[null,null,"Oransje felt fylles ut av saksbehandler",null,"HUSK Å FYLLE UT DE ORANSJE FELTENE"]
[null,null,"Grønne felt beregnes automatisk"]
[]
[null,"Kundeinformasjon",null,null,null,"Tiltak 1",null,null,"Etterisolering vegg"]
[null,"Navn",null,null,"Utføres på",null,100,null,"Yttervegg isoleres så den tilsvarer energitiltakskravet for vegg i TEK17, dvs. at den "]
[null,"Adresse",null,null,"% av fasaden.",null,null,null,"oppnår en U-verdi på ≤ 0,18 W/(m²K). Angi %-andel av fasaden som etterisoleres."]
[null,null,null,null,null,null,null,null,"Gir ikke besparelse for boliger som er bygd etter 2008."]
[]
[null,null,null,null,null,"Tiltak 2",null,null,"Etterisolering tak"]
{"$rows_left_out":42}
{"sheet":"Beregninger","index":1,"n_rows":39,"n_cols":50,"rows_kept":39,"cut":false,"hidden":true,"merged":[[12,30,12,43],[1,32,1,45]]}
[]
[null,"Graddagstall",null,{"$f":"VLOOKUP(Verktøy!C14,Input!B3:C424,2)","v":4009.6},null,null,null,null,null,null,null,null,null,null,null,null,null,null,null,null,null,null,null,null,null,null,null,null,null,null,null,null,"Småhus, besparelser i %"]
[null,"Småhus, kWh/m2 BRA",null,null,null,null,null,null,null,null,null,null,null,null,null,null,"EIso vegg","EIso tak","EIiso gulv","Vinduer","Balansert ventilasjon",null,"Nattsenking","Energieffektiv belysningsutstyr",null,"Solceller","Solfanger","Varmepumpe, luft til luft","Varmepumpe, øvrige (f.eks. luft til vann, vann til vann, avtrekksvarmepumpe)",null,null,"Tiltak 1","Tiltak 2","Tiltak 3","Tiltak 4","Tiltak 5 OP","Tiltak 5 EL","Tiltak 6","Tiltak 7 OP","Tiltak 7 EL","Tiltak 8","Tiltak 9","Tiltak 10","Tiltak 11"]
[null,null,"Byggeår","Startpunkt","RO+Vent","Varmtvann","El","Besparelse %","SP kk","RO+Vent kk","Total etter","El etter tiltak","Varmtvann etter","RO etter","Romoppv etter T 1 - 6","Trekk samtidighet","Besp T1","Besp T2","Besp T3","Besp T4","Besp T5 OP","Besp T5 EL","Besp T6","Besp T7 OP","Besp T7 EL","Besp T8 EL","Besp T9 OP","Besp T10 OP","Besp T11 OP",null,null,true,true,false,false,false,{"$f":"AJ4","v":false},false,false,{"$f":"AM4","v":false},false,false,false,false,null,"Eldre",1,0,1950,{"$f":"IF(AND(Verktøy!$C$13>=AV4,Verktøy!$C$13<=AW4),AU4,\"\")","v":1}]
[null,"Eldre","< 1950",{"$f":"Input!F5","v":387},{"$f":"Input!G5","v":289.2},{"$f":"Input!H5","v":29.8},{"$f":"D5-E5-F5","v":68.000000000000014},{"$f":"100-(K5*100/I5)","v":40.981443428067436},{"$f":"D5-E5+J5","v":383.70569554711767},{"$f":"E5*(Beregninger!$D$2/Input!$C$254)","v":285.90569554711766},{"$f":"L5+M5+N5","v":226.45756299620297},{"$f":"G5-V5-Y5-Z5","v":68.000000000000014},{"$f":"IF(F5<0,0,F5)","v":29.8},{"$f":"O5-X5-AA5-AB5-AC5","v":128.65756299620296},{"$f":"IF(J5-SUM(Q5:U5)-W5+P5<0,0,J5-SUM(Q5:U5)-W5+P5)","v":128.65756299620296},{"$f":"AB26","v":0},{"$f":"IF($AF$4=TRUE,J5*(AF5/100)*(Verktøy!$G$6/100),0)","v":114.36227821884707},{"$f":"IF($AG$4=TRUE,J5*(AG5/100)*(Verktøy!$G$11/100),0)","v":42.885854332067645},{"$f":"IF($AH$4=TRUE,J$5*(AH5/100)*(Verktøy!$G$15/100),0)","v":0},{"$f":"IF($AI$4=TRUE,J5*(AI5/100)*(Verktøy!$G$19/100),0)","v":0},{"$f":"IF($AJ$4=TRUE,J5*AJ5/100,0)","v":0},{"$f":"IF($AK$4=TRUE,G5*AK5/100,0)","v":0},{"$f":"IF($AL$4=TRUE,(J5-SUM(Q5:U5))*AL5/100*(Verktøy!$G$28/100),0)","v":0},{"$f":"IF($AM$4=TRUE,IF(G5*AM5/100<-Y5,-Y5,G5*AM5/100)*(Verktøy!$G$33/100),0)","v":0},{"$f":"IF($AN$4=TRUE,G5*AN5/100*(Verktøy!$G$33/100),0)","v":0},{"$f":"IF($AO$4=TRUE,Verktøy!$G$39/Verktøy!$C$15,0)","v":0},{"$f":"IF($AP$4=TRUE,Verktøy!$G$43/Verktøy!$C$15,0)","v":0},{"$f":"IF($AQ$4=TRUE,O5*0.3*0.8*(1-(1/2.5)),0)","v":0},{"$f":"IF($AR$4=TRUE,Verktøy!$G$51/Verktøy!$C$15,0)","v":0},null,"Eldre",40,15,16,20,2,-5,6,-9,45,null,null,null,null,null,"TEK49",2,{"$f":"AW4+1","v":1951},1970,{"$f":"IF(AND(Verktøy!$C$13>=AV5,Verktøy!$C$13<=AW5),AU5,\"\")","v":""}]
[null,"TEK49","1951-1970",{"$f":"Input!F6","v":268},{"$f":"Input!G6","v":170.5},{"$f":"Input!H6","v":29.8},{"$f":"D6-E6-F6","v":67.7},{"$f":"100-(K6*100/I6)","v":25.975070367989389},{"$f":"D6-E6+J6","v":266.05781843286155},{"$f":"E6*(Beregninger!$D$2/Input!$C$254)","v":168.55781843286155},{"$f":"L6+M6+N6","v":196.94911287538832},67.7,{"$f":"IF(F6<0,0,F6)","v":29.8},99.449112875388309,{"$f":"IF(J6-SUM(Q6:U6)-W6+P6<0,0,J6-SUM(Q6:U6)-W6+P6)","v":99.449112875388309},0,{"$f":"IF($AF$4=TRUE,J6*(AF6/100)*(Verktøy!$G$6/100),0)","v":55.624080082844316},{"$f":"IF($AG$4=TRUE,J6*(AG6/100)*(Verktøy!$G$11/100),0)","v":13.484625474628924},{"$f":"IF($AH$4=TRUE,J$6*(AH6/100)*(Verktøy!$G$15/100),0)","v":0},{"$f":"IF($AI$4=TRUE,J6*(AI6/100)*(Verktøy!$G$19/100),0)","v":0},0,0,{"$f":"IF($AL$4=TRUE,(J6-SUM(Q6:U6))*AL6/100*(Verktøy!$G$28/100),0)","v":0},{"$f":"IF($AM$4=TRUE,IF(G6*AM6/100<-Y6,-Y6,G6*AM6/100)*(Verktøy!$G$33/100),0)","v":0},{"$f":"IF($AN$4=TRUE,G6*AN6/100*(Verktøy!$G$33/100),0)","v":0},{"$f":"IF($AO$4=TRUE,Verktøy!$G$39/Verktøy!$C$15,0)","v":0},{"$f":"IF($AP$4=TRUE,Verktøy!$G$43/Verktøy!$C$15,0)","v":0},{"$f":"IF($AQ$4=TRUE,O6*0.3*0.8*(1-(1/2.5)),0)","v":0},{"$f":"IF($AR$4=TRUE,Verktøy!$G$51/Verktøy!$C$15,0)","v":0},null,"TEK49",33,8,6,33,3,-5,6,-15,45,null,null,null,null,null,"TEK69",3,{"$f":"AW5+1","v":1971},1988,{"$f":"IF(AND(Verktøy!$C$13>=AV6,Verktøy!$C$13<=AW6),AU6,\"\")","v":""}]
[null,"TEK69","1971 - 1988",{"$f":"Input!F7","v":253.4},{"$f":"Input!G7","v":155.80000000000001},{"$f":"Input!H7","v":29.8},67.8,{"$f":"100-(K7*100/I7)","v":18.975770359460839},251.62526751812217,{"$f":"E7*(Beregninger!$D$2/Input!$C$254)","v":154.02526751812218},{"$f":"L7+M7+N7","v":203.8774345875043},67.8,29.8,106.2774345875043,106.2774345875043,0,{"$f":"IF($AF$4=TRUE,J7*(AF7/100)*(Verktøy!$G$6/100),0)","v":36.966064204349323},{"$f":"IF($AG$4=TRUE,J7*(AG7/100)*(Verktøy!$G$11/100),0)","v":10.781768726268554},{"$f":"IF($AH$4=TRUE,J$7*(AH7/100)*(Verktøy!$G$15/100),0)","v":0},{"$f":"IF($AI$4=TRUE,J7*(AI7/100)*(Verktøy!$G$19/100),0)","v":0},0,0,{"$f":"IF($AL$4=TRUE,(J7-SUM(Q7:U7))*AL7/100*(Verktøy!$G$28/100),0)","v":0},{"$f":"IF($AM$4=TRUE,IF(G7*AM7/100<-Y7,-Y7,G7*AM7/100)*(Verktøy!$G$33/100),0)","v":0},{"$f":"IF($AN$4=TRUE,G7*AN7/100*(Verktøy!$G$33/100),0)","v":0},{"$f":"IF($AO$4=TRUE,Verktøy!$G$39/Verktøy!$C$15,0)","v":0},{"$f":"IF($AP$4=TRUE,Verktøy!$G$43/Verktøy!$C$15,0)","v":0},0,{"$f":"IF($AR$4=TRUE,Verktøy!$G$51/Verktøy!$C$15,0)","v":0},null,"TEK69",24,7,7,33,3,-6,6,{"$f":"-39*(Beregninger!$D$2/Input!$C$254)","v":-38.555747324818775},56,null,null,null,null,null,"TEK87",4,1989,1998,{"$f":"IF(AND(Verktøy!$C$13>=AV7,Verktøy!$C$13<=AW7),AU7,\"\")","v":""}]
[null,"TEK87","1989 - 1998",{"$f":"Input!F8","v":208},{"$f":"Input!G8","v":139},{"$f":"Input!H8","v":29.8},39.200000000000003,11.983043166345865,206.41663790127717,{"$f":"E8*(Beregninger!$D$2/Input!$C$254)","v":137.41663790127717},181.68164307904726,39.200000000000003,29.8,112.68164307904728,112.68164307904728,0,{"$f":"IF($AF$4=TRUE,J8*(AF8/100)*(Verktøy!$G$6/100),0)","v":21.986662064204349},{"$f":"IF($AG$4=TRUE,J8*(AG8/100)*(Verktøy!$G$11/100),0)","v":2.7483327580255437},{"$f":"IF($AH$4=TRUE,J$8*(AH8/100)*(Verktøy!$G$15/100),0)","v":0},{"$f":"IF($AI$4=TRUE,J8*(AI8/100)*(Verktøy!$G$19/100),0)","v":0},0,0,{"$f":"IF($AL$4=TRUE,(J8-SUM(Q8:U8))*AL8/100*(Verktøy!$G$28/100),0)","v":0},{"$f":"IF($AM$4=TRUE,IF(G8*AM8/100<-Y8,-Y8,G8*AM8/100)*(Verktøy!$G$33/100),0)","v":0},{"$f":"IF($AN$4=TRUE,G8*AN8/100*(Verktøy!$G$33/100),0)","v":0},{"$f":"IF($AO$4=TRUE,Verktøy!$G$39/Verktøy!$C$15,0)","v":0},{"$f":"IF($AP$4=TRUE,Verktøy!$G$43/Verktøy!$C$15,0)","v":0},0,{"$f":"IF($AR$4=TRUE,Verktøy!$G$51/Verktøy!$C$15,0)","v":0},null,"TEK87",16,2,6,28,6,0,6,{"$f":"-8.7*(Beregninger!$D$2/Input!$C$254)","v":-8.6008974801518789},12,null,null,null,null,null,"TEK97",5,1999,2008,{"$f":"IF(AND(Verktøy!$C$13>=AV8,Verktøy!$C$13<=AW8),AU8,\"\")","v":""}]
[null,"TEK97","1999 - 2008",{"$f":"Input!F9","v":161.69999999999999},{"$f":"Input!G9","v":92.8},{"$f":"Input!H9","v":29.8},39.099999999999994,6.8531807706563939,160.64290645495339,{"$f":"E9*(Beregninger!$D$2/Input!$C$254)","v":91.742906454953385},149.63375768035897,39.099999999999994,29.8,80.733757680358977,80.733757680358977,0,{"$f":"IF($AF$4=TRUE,J9*(AF9/100)*(Verktøy!$G$6/100),0)","v":11.009148774594406},{"$f":"IF($AG$4=TRUE,J9*(AG9/100)*(Verktøy!$G$11/100),0)","v":0},{"$f":"IF($AH$4=TRUE,J$9*(AH9/100)*(Verktøy!$G$15/100),0)","v":0},{"$f":"IF($AI$4=TRUE,J9*(AI9/100)*(Verktøy!$G$19/100),0)","v":0},0,0,{"$f":"IF($AL$4=TRUE,(J9-SUM(Q9:U9))*AL9/100*(Verktøy!$G$28/100),0)","v":0},{"$f":"IF($AM$4=TRUE,IF(G9*AM9/100<-Y9,-Y9,G9*AM9/100)*(Verktøy!$G$33/100),0)","v":0},{"$f":"IF($AN$4=TRUE,G9*AN9/100*(Verktøy!$G$33/100),0)","v":0},{"$f":"IF($AO$4=TRUE,Verktøy!$G$39/Verktøy!$C$15,0)","v":0},{"$f":"IF($AP$4=TRUE,Verktøy!$G$43/Verktøy!$C$15,0)","v":0},0,{"$f":"IF($AR$4=TRUE,Verktøy!$G$51/Verktøy!$C$15,0)","v":0},null,"TEK97",12,0,3,19,9,0,0,{"$f":"-8.1*(Beregninger!$D$2/Input!$C$254)","v":-8.0077321366931287},12,null,null,null,null,null,"TEK07",6,2009,2011,{"$f":"IF(Verktøy!$C$13>=AV9,AU9,\"\")","v":""}]
[null,"TEK07","2009 -",{"$f":"Input!F10","v":132.6},{"$f":"Input!G10","v":61.1},{"$f":"Input!H10","v":29.8},41.7,0,131.90400414221608,{"$f":"E10*(Beregninger!$D$2/Input!$C$254)","v":60.404004142216081},131.90400414221608,41.7,29.8,60.404004142216081,60.404004142216081,0,{"$f":"IF($AF$4=TRUE,J10*(AF10/100)*(Verktøy!$G$6/100),0)","v":0},{"$f":"IF($AG$4=TRUE,J10*(AG10/100)*(Verktøy!$G$11/100),0)","v":0},{"$f":"IF($AH$4=TRUE,J$10*(AH10/100)*(Verktøy!$G$15/100),0)","v":0},{"$f":"IF($AI$4=TRUE,J10*(AI10/100)*(Verktøy!$G$19/100),0)","v":0},0,0,{"$f":"IF($AL$4=TRUE,(J10-SUM(Q10:U10))*AL10/100*(Verktøy!$G$28/100),0)","v":0},{"$f":"IF($AM$4=TRUE,IF(G10*AM10/100<-Y10,-Y10,G10*AM10/100)*(Verktøy!$G$33/100),0)","v":0},{"$f":"IF($AN$4=TRUE,G10*AN10/100*(Verktøy!$G$33/100),0)","v":0},{"$f":"IF($AO$4=TRUE,Verktøy!$G$39/Verktøy!$C$15,0)","v":0},{"$f":"IF($AP$4=TRUE,Verktøy!$G$43/Verktøy!$C$15,0)","v":0},0,{"$f":"IF($AR$4=TRUE,Verktøy!$G$51/Verktøy!$C$15,0)","v":0},null,"TEK07",0,0,5,23,6,7,0,{"$f":"-7.3*(Beregninger!$D$2/Input!$C$254)","v":-7.2168450120814622},12,null,null,null,null,null,null,null,null,null,{"$f":"SUM(AX4:AX9)","v":1}]
{"$rows_left_out":30}
{"sheet":"Energimerke D","index":2,"n_rows":39,"n_cols":50,"rows_kept":39,"cut":false,"hidden":true,"merged":[[1,32,1,45],[12,30,12,43],[23,1,23,4],[24,1,24,4]]}
[]
[null,"Graddagstall",null,{"$f":"Input!$C$254","v":4055.8},null,null,null,null,null,null,null,null,null,null,null,null,null,null,null,null,null,null,null,null,null,null,null,null,null,null,null,null,"Småhus, besparelser i %"]
[null,"Småhus, kWh/m2 BRA",null,null,null,null,null,null,null,null,null,null,null,null,null,null,"EIso vegg","EIso tak","EIiso gulv","Vinduer","Balansert ventilasjon",null,"Nattsenking","Energieffektiv belysningsutstyr",null,"Solceller","Solfanger","Varmepumpe, luft til luft","Varmepumpe, øvrige (f.eks. luft til vann, vann til vann, avtrekksvarmepumpe)",null,null,"Tiltak 1","Tiltak 2","Tiltak 3","Tiltak 4","Tiltak 5 OP","Tiltak 5 EL","Tiltak 6","Tiltak 7 OP","Tiltak 7 EL","Tiltak 8","Tiltak 9","Tiltak 10","Tiltak 11"]
[null,null,"Byggeår","Startpunkt","RO+Vent","Varmtvann","El","Besparelse %","SP kk","RO+Vent kk","Total etter","El etter tiltak","Varmtvann etter","RO etter","Romoppv etter T 1 - 6","Trekk samtidighet","Besp T1","Besp T2","Besp T3","Besp T4","Besp T5 OP","Besp T5 EL","Besp T6","Besp T7 OP","Besp T7 EL","Besp T8 EL","Besp T9 OP","Besp T10 OP","Besp T11 OP",null,null,{"$f":"Beregninger!AF4","v":true},{"$f":"Beregninger!AG4","v":true},{"$f":"Beregninger!AH4","v":false},{"$f":"Beregninger!AI4","v":false},{"$f":"Beregninger!AJ4","v":false},{"$f":"Beregninger!AK4","v":false},{"$f":"Beregninger!AL4","v":false},{"$f":"Beregninger!AM4","v":false},{"$f":"Beregninger!AN4","v":false},{"$f":"Beregninger!AO4","v":false},{"$f":"Beregninger!AP4","v":false},{"$f":"Beregninger!AQ4","v":false},{"$f":"Beregninger!AR4","v":false},null,"Eldre",1,0,1950,{"$f":"IF(AND(Verktøy!$C$13>=AV4,Verktøy!$C$13<=AW4),AU4,\"\")","v":1}]
[null,"Eldre","< 1950",{"$f":"Input!F15","v":339.6},{"$f":"Input!G15","v":279.5},{"$f":"Input!H15","v":29.8},{"$f":"D5-E5-F5","v":30.300000000000022},{"$f":"100-(K5*100/I5)","v":45.266489988221437},{"$f":"D5-E5+J5","v":339.6},{"$f":"E5*('Energimerke D'!$D$2/Input!$C$254)","v":279.5},{"$f":"L5+M5+N5","v":185.875},{"$f":"G5-V5-Y5-Z5","v":30.300000000000022},{"$f":"IF(F5<0,0,F5)","v":29.8},{"$f":"O5-X5-AA5-AB5-AC5","v":125.77499999999998},{"$f":"IF(J5-SUM(Q5:U5)-W5+P5<0,0,J5-SUM(Q5:U5)-W5+P5)","v":125.77499999999998},{"$f":"AB26","v":0},{"$f":"IF($AF$4=TRUE,J5*(AF5/100)*(Verktøy!$G$6/100),0)","v":111.80000000000001},{"$f":"IF($AG$4=TRUE,J5*(AG5/100)*(Verktøy!$G$11/100),0)","v":41.924999999999997},{"$f":"IF($AH$4=TRUE,J$5*(AH5/100)*(Verktøy!$G$15/100),0)","v":0},{"$f":"IF($AI$4=TRUE,J5*(AI5/100)*(Verktøy!$G$19/100),0)","v":0},{"$f":"IF($AJ$4=TRUE,J5*AJ5/100,0)","v":0},{"$f":"IF($AK$4=TRUE,G5*AK5/100,0)","v":0},{"$f":"IF($AL$4=TRUE,(J5-SUM(Q5:U5))*AL5/100*(Verktøy!$G$28/100),0)","v":0},{"$f":"IF($AM$4=TRUE,IF(G5*AM5/100<-Y5,-Y5,G5*AM5/100)*(Verktøy!$G$33/100),0)","v":0},{"$f":"IF($AN$4=TRUE,G5*AN5/100*(Verktøy!$G$33/100),0)","v":0},{"$f":"IF($AO$4=TRUE,Verktøy!$G$39/Verktøy!$C$15,0)","v":0},{"$f":"IF($AP$4=TRUE,Verktøy!$G$43/Verktøy!$C$15,0)","v":0},{"$f":"IF($AQ$4=TRUE,O5*0.3*0.8*(1-(1/2.5)),0)","v":0},{"$f":"IF($AR$4=TRUE,Verktøy!$G$51/Verktøy!$C$15*Input!$C$254/Beregninger!$D$2,0)","v":0},null,"Eldre",40,15,16,20,2,-5,0,0,0,null,null,null,null,null,"TEK49",2,{"$f":"AW4+1","v":1951},1970,{"$f":"IF(AND(Verktøy!$C$13>=AV5,Verktøy!$C$13<=AW5),AU5,\"\")","v":""}]
[null,"TEK49","1951-1970",{"$f":"Input!F16","v":233.2},{"$f":"Input!G16","v":173.2},{"$f":"Input!H16","v":29.8},{"$f":"D6-E6-F6","v":30.2},{"$f":"100-(K6*100/I6)","v":30.451114922813034},{"$f":"D6-E6+J6","v":233.2},{"$f":"E6*('Energimerke D'!$D$2/Input!$C$254)","v":173.2},{"$f":"L6+M6+N6","v":162.18799999999999},30.2,{"$f":"IF(F6<0,0,F6)","v":29.8},102.18799999999999,{"$f":"IF(J6-SUM(Q6:U6)-W6+P6<0,0,J6-SUM(Q6:U6)-W6+P6)","v":102.18799999999999},0,{"$f":"IF($AF$4=TRUE,J6*(AF6/100)*(Verktøy!$G$6/100),0)","v":57.155999999999999},{"$f":"IF($AG$4=TRUE,J6*(AG6/100)*(Verktøy!$G$11/100),0)","v":13.856},{"$f":"IF($AH$4=TRUE,J$6*(AH6/100)*(Verktøy!$G$15/100),0)","v":0},{"$f":"IF($AI$4=TRUE,J6*(AI6/100)*(Verktøy!$G$19/100),0)","v":0},0,0,{"$f":"IF($AL$4=TRUE,(J6-SUM(Q6:U6))*AL6/100*(Verktøy!$G$28/100),0)","v":0},{"$f":"IF($AM$4=TRUE,IF(G6*AM6/100<-Y6,-Y6,G6*AM6/100)*(Verktøy!$G$33/100),0)","v":0},{"$f":"IF($AN$4=TRUE,G6*AN6/100*(Verktøy!$G$33/100),0)","v":0},{"$f":"IF($AO$4=TRUE,Verktøy!$G$39/Verktøy!$C$15,0)","v":0},{"$f":"IF($AP$4=TRUE,Verktøy!$G$43/Verktøy!$C$15,0)","v":0},0,{"$f":"IF($AR$4=TRUE,Verktøy!$G$51/Verktøy!$C$15*Input!$C$254/Beregninger!$D$2,0)","v":0},null,"TEK49",33,8,6,33,3,-5,0,0,0,null,null,null,null,null,"TEK69",3,{"$f":"AW5+1","v":1971},1988,{"$f":"IF(AND(Verktøy!$C$13>=AV6,Verktøy!$C$13<=AW6),AU6,\"\")","v":""}]
[null,"TEK69","1971 - 1988",{"$f":"Input!F17","v":220},{"$f":"Input!G17","v":160},{"$f":"Input!H17","v":29.8},30.2,{"$f":"100-(K7*100/I7)","v":22.545454545454547},220,{"$f":"E7*('Energimerke D'!$D$2/Input!$C$254)","v":160},{"$f":"L7+M7+N7","v":170.4},30.2,29.8,110.4,110.4,0,{"$f":"IF($AF$4=TRUE,J7*(AF7/100)*(Verktøy!$G$6/100),0)","v":38.4},{"$f":"IF($AG$4=TRUE,J7*(AG7/100)*(Verktøy!$G$11/100),0)","v":11.200000000000001},{"$f":"IF($AH$4=TRUE,J$7*(AH7/100)*(Verktøy!$G$15/100),0)","v":0},{"$f":"IF($AI$4=TRUE,J7*(AI7/100)*(Verktøy!$G$19/100),0)","v":0},0,0,{"$f":"IF($AL$4=TRUE,(J7-SUM(Q7:U7))*AL7/100*(Verktøy!$G$28/100),0)","v":0},{"$f":"IF($AM$4=TRUE,IF(G7*AM7/100<-Y7,-Y7,G7*AM7/100)*(Verktøy!$G$33/100),0)","v":0},{"$f":"IF($AN$4=TRUE,G7*AN7/100*(Verktøy!$G$33/100),0)","v":0},{"$f":"IF($AO$4=TRUE,Verktøy!$G$39/Verktøy!$C$15,0)","v":0},{"$f":"IF($AP$4=TRUE,Verktøy!$G$43/Verktøy!$C$15,0)","v":0},0,{"$f":"IF($AR$4=TRUE,Verktøy!$G$51/Verktøy!$C$15*Input!$C$254/Beregninger!$D$2,0)","v":0},null,"TEK69",24,7,7,33,3,-6,0,0,0,null,null,null,null,null,"TEK87",4,1989,1998,{"$f":"IF(AND(Verktøy!$C$13>=AV7,Verktøy!$C$13<=AW7),AU7,\"\")","v":""}]
[null,"TEK87","1989 - 1998",{"$f":"Input!F18","v":189.3},{"$f":"Input!G18","v":125.2},{"$f":"Input!H18","v":29.8},34.300000000000011,11.904912836767039,189.3,{"$f":"E8*('Energimerke D'!$D$2/Input!$C$254)","v":125.2},166.76400000000001,34.300000000000011,29.8,102.664,102.664,0,{"$f":"IF($AF$4=TRUE,J8*(AF8/100)*(Verktøy!$G$6/100),0)","v":20.032},{"$f":"IF($AG$4=TRUE,J8*(AG8/100)*(Verktøy!$G$11/100),0)","v":2.504},{"$f":"IF($AH$4=TRUE,J$8*(AH8/100)*(Verktøy!$G$15/100),0)","v":0},{"$f":"IF($AI$4=TRUE,J8*(AI8/100)*(Verktøy!$G$19/100),0)","v":0},0,0,{"$f":"IF($AL$4=TRUE,(J8-SUM(Q8:U8))*AL8/100*(Verktøy!$G$28/100),0)","v":0},{"$f":"IF($AM$4=TRUE,IF(G8*AM8/100<-Y8,-Y8,G8*AM8/100)*(Verktøy!$G$33/100),0)","v":0},{"$f":"IF($AN$4=TRUE,G8*AN8/100*(Verktøy!$G$33/100),0)","v":0},{"$f":"IF($AO$4=TRUE,Verktøy!$G$39/Verktøy!$C$15,0)","v":0},{"$f":"IF($AP$4=TRUE,Verktøy!$G$43/Verktøy!$C$15,0)","v":0},0,{"$f":"IF($AR$4=TRUE,Verktøy!$G$51/Verktøy!$C$15*Input!$C$254/Beregninger!$D$2,0)","v":0},null,"TEK87",16,2,6,28,6,0,0,0,0,null,null,null,null,null,"TEK97",5,1999,2008,{"$f":"IF(AND(Verktøy!$C$13>=AV8,Verktøy!$C$13<=AW8),AU8,\"\")","v":""}]
[null,"TEK97","1999 - 2008",{"$f":"Input!F19","v":153.1},{"$f":"Input!G19","v":89.1},{"$f":"Input!H19","v":29.8},34.200000000000003,6.9836708033964641,153.1,{"$f":"E9*('Energimerke D'!$D$2/Input!$C$254)","v":89.1},142.40800000000002,34.200000000000003,29.8,78.408000000000001,78.408000000000001,0,{"$f":"IF($AF$4=TRUE,J9*(AF9/100)*(Verktøy!$G$6/100),0)","v":10.691999999999998},{"$f":"IF($AG$4=TRUE,J9*(AG9/100)*(Verktøy!$G$11/100),0)","v":0},{"$f":"IF($AH$4=TRUE,J$9*(AH9/100)*(Verktøy!$G$15/100),0)","v":0},{"$f":"IF($AI$4=TRUE,J9*(AI9/100)*(Verktøy!$G$19/100),0)","v":0},0,0,{"$f":"IF($AL$4=TRUE,(J9-SUM(Q9:U9))*AL9/100*(Verktøy!$G$28/100),0)","v":0},{"$f":"IF($AM$4=TRUE,IF(G9*AM9/100<-Y9,-Y9,G9*AM9/100)*(Verktøy!$G$33/100),0)","v":0},{"$f":"IF($AN$4=TRUE,G9*AN9/100*(Verktøy!$G$33/100),0)","v":0},{"$f":"IF($AO$4=TRUE,Verktøy!$G$39/Verktøy!$C$15,0)","v":0},{"$f":"IF($AP$4=TRUE,Verktøy!$G$43/Verktøy!$C$15,0)","v":0},0,{"$f":"IF($AR$4=TRUE,Verktøy!$G$51/Verktøy!$C$15*Input!$C$254/Beregninger!$D$2,0)","v":0},null,"TEK97",12,0,3,19,9,0,0,0,0,null,null,null,null,null,"TEK07",6,2009,2011,{"$f":"IF(Verktøy!$C$13>=AV9,AU9,\"\")","v":""}]
[null,"TEK07","2009 -",{"$f":"Input!F20","v":125.8},{"$f":"Input!G20","v":59.1},{"$f":"Input!H20","v":29.8},36.899999999999991,0,125.79999999999998,{"$f":"E10*('Energimerke D'!$D$2/Input!$C$254)","v":59.1},125.79999999999998,36.899999999999991,29.8,59.1,59.1,0,{"$f":"IF($AF$4=TRUE,J10*(AF10/100)*(Verktøy!$G$6/100),0)","v":0},{"$f":"IF($AG$4=TRUE,J10*(AG10/100)*(Verktøy!$G$11/100),0)","v":0},{"$f":"IF($AH$4=TRUE,J$10*(AH10/100)*(Verktøy!$G$15/100),0)","v":0},{"$f":"IF($AI$4=TRUE,J10*(AI10/100)*(Verktøy!$G$19/100),0)","v":0},0,0,{"$f":"IF($AL$4=TRUE,(J10-SUM(Q10:U10))*AL10/100*(Verktøy!$G$28/100),0)","v":0},{"$f":"IF($AM$4=TRUE,IF(G10*AM10/100<-Y10,-Y10,G10*AM10/100)*(Verktøy!$G$33/100),0)","v":0},{"$f":"IF($AN$4=TRUE,G10*AN10/100*(Verktøy!$G$33/100),0)","v":0},{"$f":"IF($AO$4=TRUE,Verktøy!$G$39/Verktøy!$C$15,0)","v":0},{"$f":"IF($AP$4=TRUE,Verktøy!$G$43/Verktøy!$C$15,0)","v":0},0,{"$f":"IF($AR$4=TRUE,Verktøy!$G$51/Verktøy!$C$15*Input!$C$254/Beregninger!$D$2,0)","v":0},null,"TEK07",0,0,5,23,6,7,0,0,0,null,null,null,null,null,null,null,null,null,{"$f":"SUM(AX4:AX9)","v":1}]
{"$rows_left_out":30}
{"sheet":"Input","index":3,"n_rows":358,"n_cols":13,"rows_kept":358,"cut":false,"hidden":true,"merged":[[2,5,2,6],[2,8,2,9],[12,5,12,6],[12,8,12,9]]}
[]
[null,"Kommune","GDT 19",null,"Startpunkter besparelse",null,null,null,null,null,null,null,"Rekkehus, enebolig, to- eller firemannsbolig"]
[null,"Alstahaug",4009.6,null,null,"Småhus",null,null,"Boligblokk",null,null,null,"Leilighet i boligblokk"]
[null,"Alta",5406.4,null,null,"Tot","RO+Vent","VV","Tot","RO+Vent","VV"]
[null,"Alvdal",5577.4,null,"Eldre",387,289.2,29.8,297.3,199.7,29.8]
[null,"Alver",3344.6999999999994,null,"TEK49",268,170.5,29.8,245.1,147.80000000000001,29.8]
[null,"Andøy",4499.6000000000004,null,"TEK69",253.4,155.80000000000001,29.8,214.7,112.1,29.8]
[null,"Aremark",3900,null,"TEK87",208,139,29.8,176.2,106.3,29.8]
[null,"Arendal",3361.7,null,"TEK97",161.69999999999999,92.8,29.8,146.1,76.599999999999994,29.8]
[null,"Asker",3808.7333333333336,null,"TEK07",132.6,61.1,29.8,115.8,42.7,29.8]
{"$rows_left_out":348}